大约有 40,000 项符合查询结果(耗时:0.0292秒) [XML]
html5 localStorage error with Safari: “QUOTA_EXCEEDED_ERR: DOM Exception 22: An attempt was made to
My webapp have javascript errors in ios safari private browsing:
15 Answers
15
...
Error when trying to obtain a certificate: The specified item could not be found in the keychain
...thout triggering the The specified item could not be found in the keychain error.
share
|
improve this answer
|
follow
|
...
AngularJS validation with no enclosing
...="form-control" ng-model="bindTo" ng-maxlength="5">
<span class="error" ng-show="myForm.myInput.$error.maxlength">Too long!</span>
</div>
Example
share
|
improve this answ...
Installing Google Protocol Buffers on mac
...
On running the make command I ended up with errors:3 errors generated. make[2]: *** [message.lo] Error 1 make[1]: *** [all-recursive] Error 1 make: *** [all] Error 2
– Anandaraja_Srinivasan
Aug 19 '16 at 9:25
...
Macro vs Function in C
...
Macros are error-prone because they rely on textual substitution and do not perform type-checking. For example, this macro:
#define square(a) a * a
works fine when used with an integer:
square(5) --> 5 * 5 --> 25
but does ve...
DROP IF EXISTS VS DROP?
... syntax is
DROP TABLE IF EXISTS table_name;
The first one will throw an error if the table doesn't exist, or if other database objects depend on it. Most often, the other database objects will be foreign key references, but there may be others, too. (Views, for example.) The second will not th...
Objective-C pass block as parameter
...
Example
-(void) saveWithCompletionBlock: (void (^)(NSArray *elements, NSError *error))completionBlock{
// your code
}
Other use of cases:
2. Block as a Property
Template
@property (nonatomic, copy) returnType (^blockName)(parameters);
Example
@property (nonatomic,copy)void (^compl...
Jenkins on OS X: xcodebuild gives Code Sign error
... keychain).
This got me passed the certificate/private key pair code sign error but opened up another one with the provisioning profile (seems like a similar, but different, issue).
share
|
improve...
What does “The APR based Apache Tomcat Native library was not found” mean?
...
+1 I was getting this error (posted by OP) only under Eclipse, eventhough it was fixed when i run it standalone (of course, after adding the native lib.) Thanks for the tip on setting the system property!
– asgs
...
IntelliJ gives Fatal Error: Unable to find package java.lang in classpath or bootclasspath
...
This error happend to me after i've updated my JDK version to jdk1.8.0_161 -
But the project's sdk was still pointing to the old jdk 1.8.0_131
(Seems that updgrading java causing the previous version to be wiped).
Do this:
In...
