大约有 15,630 项符合查询结果(耗时:0.0135秒) [XML]
configure: error: png.h not found.错误的解决方法 - 更多技术 - 清泛网 -...
configure: error: png.h not found.错误的解决方法yum install libpng-develyum install libpng-develpng.h
configure: error: freetype-config not found. - 更多技术 - 清泛网 - 专注C/C++及内核技术
configure: error: freetype-config not found.centos:yum install freetype-develdebian: apt-get install libfreetype6-devcentos: yum install freetype-devel
debian: apt-get install libfreetype6-devfreetype-config
plsql 存储过程 事务 - 更多技术 - 清泛网 - 专注C/C++及内核技术
...ers then
rollback;
v_msg:='失败成功';
RAISE_APPLICATION_ERROR(-20010, 'ERROR:违反唯一索引约束!');
end;
others处本应该写异常名称,如果不想把异常分得那麼细,可以笼统一点用others来捕获,即所有异常均用others来捕获。
RAISE_APP...
mongodb, replicates and error: { “$err” : “not master and slaveOk=f...
出现这个错误的原因是在从库上执行命令导致,默认情况下只有主库可以执行命令。
当然可以通过设置使得从库也能执行命令,具体参见:
http://stackoverflow.com/questions/8990158/mongodb-replicates-and-error-err-not-master-and-slaveok-false-code
虚拟机安装CentOS出错:EDD:Error 8000 reading sector 2106934 - 环境配置...
EDD:Error 8000 reading sector 2106934
No DEFAULT or UI configuration directive found!
boot:
Getting closer!
When i start to install every thing seem to be fine.
1.Select language k
2.select location k
3.configure keyboard k
4.network config k
then it gets stuck on a purple screen with n...
【解决】PHP Fatal error: require_once(): Failed opening required \'/u...
【解决】PHP Fatal error: require_once(): Failed opening required '/usr/share/php/php-gettext/gettext.inc'php缺失相关模块导致,解决方法很简单:apt-get install php-gettext重启apache2即可。php缺失相关模块导致,解决方法很简单:
apt-get install php-gettext
...
Error 1103: Unable to complete the given request with the text - App I...
报错信息:
Error 1103: Unable to complete the given request with the text "key=&ipaddr=1
92.168.1.4&port=9987&web
rtc=true&version=2.69&api=3
4&installer=com.hihonor.bai
du.browser&aid=9fd2eba4-b
84e-4db7-8442-d956c74172
8e&r2=true&useproxy=true&q...
解决 App Inventor 2 Runtime Error运行时错误的专业指南 - App Inventor 2...
解决 App Inventor 2 Runtime Error运行时错误的专业指南AppInventorRuntimeError解决 MIT App Inventor 运行时错误的专业指南引言在使用 MIT App Inventor 开发应用程序时,运行时错误是开发者经常遇到的问题。这些错误可能源于不同的原因,如组...
解决 App Inventor 2 Runtime Error运行时错误的专业指南 - App Inventor 2...
解决 App Inventor 2 Runtime Error运行时错误的专业指南AppInventorRuntimeError解决 MIT App Inventor 运行时错误的专业指南引言在使用 MIT App Inventor 开发应用程序时,运行时错误是开发者经常遇到的问题。这些错误可能源于不同的原因,如组...
Error 507: unable to connect. is the device turned on? 无法连接,设备...
...身有问题导致的。
https://community.appinventor.mit.edu/t/error-507-unable-to-connect/1474
BluetoothClient 组件仅支持支持串行端口配置文件 (SPP) 的设备。如果您的设备通过除 SPP UUID 之外的 UUID 支持 RFCOMM,则需要使用 ConnectWithUUID 块并指定...